{"text_format":"2","workbook":"xlsx","n_sheets":6,"sheets":["Cuestionario PN","Cuestionario Sociedades","PLANTILLA","Código actividades","Tarifa PN","Tarifas SIMPLE"],"not_rendered":{"charts":0,"images":2,"macros":0,"external_links":0,"defined_names":1,"comments":0,"pivot_tables":0},"unopened":[],"bounds":{"document_bytes":16777216,"sheet_cells":100000,"run_cost":"one","rows_first":2000,"rows_last":500,"rows_between":2000,"halvings":0,"cell_chars":16384,"cell_head_chars":4096},"cells_cut":0,"cells_raw":0,"read":"whole","date_system":"1900"}

{"sheet":"Cuestionario PN","index":0,"n_rows":34,"n_cols":7,"rows_kept":34,"cut":false,"hidden":false,"merged":[[31,0,31,6],[33,0,33,6],[34,0,34,6],[1,0,1,6],[5,1,5,3],[6,1,6,3],[14,4,16,4],[15,1,15,3],[30,0,30,6],[22,1,22,4],[28,0,28,6],[7,1,7,4],[8,1,8,4],[9,1,9,4],[23,1,23,4]]}
[]
["MATRIZ PARA DECIDIR SI PUEDE PERTENECER AL RÉGIMEN SIMPLE"]
[]
[null,"A. PERSONA NATURAL NACIONAL O EXTRANJERA",{"$nulls":4},"S/N"]
[]
[1,"Residente en Colombia?",{"$nulls":4},"SI"]
[2,"Desarrolla una empresa?",{"$nulls":4},"SI"]
[3,"Ingresos brutos del año anterior menores  a 100.000 UVT? Revise el monto consolidado si es socio o administra sociedades. Art. 905 E.T. \nEl tope de ingresos brutos del año anterior deberán ser menores a 12.000 UVT para el caso de personas que presten servicios profesionales, de consultoría y científicos en los que predomine el factor intelectual sobre el material (diferentes  de las actividades de educación, atención de la salud humana y asistencia social del grupo 4) ",{"$nulls":4},"SI"]
[4,"Ingresos brutos del presente año de inicio menores  a 100.000 UVT ? Revise el monto consolidado si es socio o administra sociedades. Art. 905 E.T.\nPara los servicios profesionales del grupo 5, el tope de ingresos brutos del presente año deberán ser inferiores a 12.000 UVT ",{"$nulls":4},"SI"]
[5,"Si realiza actividades de recolección, recuperación y comercialización de desperdicios, desechos y chatarra, de que trata el grupo 6 ¿verificó que las utilidades netas sean iguales o inferiores al 3% del ingreso bruto?. Nral 11 Art. 906 E.T.",{"$nulls":4},"SI"]
[6,"Cuenta con inscripción activa en el RUT y con todos mecanismos de cumplimiento del sistema de facturación electrónica?",{"$nulls":4},"SI"]
[7,"Esta en capacidad de tener firma electrónica?",{"$nulls":4},"SI"]
[8,"En el  ejercicio de sus actividades se configuran los elementos propios de un contrato realidad laboral?",{"$nulls":4},"NO"]
[9,"Se dedica a las actividades de microcrédito?",{"$nulls":4},"NO"]
[10,"Es intermediario en gestión y venta de activos?",null,null,"Con ingresos brutos ≥  al 20% de los ingresos totales",null,"NO"]
[11,"Recibe arrendamientos?",{"$nulls":4},"NO"]
[12,"Realiza actividades que generan rentas pasivas? (dividendos, intereses, explotación de intangibles, etc, art. 884 E.T)",{"$nulls":4},"NO"]
[13,"Presta servicios de asesoría financiera y/o estructuración de créditos?",{"$nulls":4},"NO"]
[14,"Realiza actividades de factoraje?",{"$nulls":4},"NO"]
[15,"Realiza actividades de importación, exportación o comercialización de automóviles?",{"$nulls":4},"NO"]
[16,"Realiza la actividad de importación de combustibles?",{"$nulls":4},"NO"]
[17,"Desarrolla simultáneamente una de las actividades ubicadas en los numerales  10 a 18 y otra diferente?.",{"$nulls":4},"NO"]
[18,"¿Tiene rentas exentas o descuentos tributarios significativos? Recuerde que en el sistema SIMPLE se pierden estos beneficios",{"$nulls":4},"NO"]
[19,"Realizó la matriz de decisión y determinó un ahorro en impuestos según sus ingresos ,la rentabilidad, el efecto en el IVA para el Grupo 1 y el costo de los aportes obligatorios a pensiones del personal vinculado?",{"$nulls":4},"SI"]
[]
[]
[null,"¿SE PUEDE ACOGER AL RÉGIMEN SIMPLE?",{"$nulls":4},{"$f":"IF(AND(G6=\"SI\",G7=\"SI\",G8=\"SI\",G9=\"SI\",G10=\"SI\",G11=\"SI\",G12=\"SI\",G13=\"NO\",G14=\"NO\",G15=\"NO\",G16=\"NO\",G17=\"NO\",G18=\"NO\",G19=\"NO\",G20=\"NO\",G21=\"NO\",G22=\"NO\",G23=\"NO\",G24=\"SI\"),\"SÍ\",\"NO\")","v":"SÍ"}]
[]
["Si al responder alguna de las preguntas propuestas aparece el semáforo en rojo, se traducirá  que   el contribuyente no podrá acogerse este sistema."]
[]
["* Si al evaluar todas las anteriores variables su cliente acierta todas las respuestas marcadas con color azul en el SI  y en el NO, "]
["   tal como están estructuradas, usted se puede acoger al régimen SIMPLE."]
[]
["* Con una sola respuesta en sentido contrario  a las afirmaciones del SI o NO propuestas,  su cliente no podrá pertenecer al régimen SIMPLE. "]

{"sheet":"Cuestionario Sociedades","index":1,"n_rows":45,"n_cols":4,"rows_kept":45,"cut":false,"hidden":false,"merged":[[43,0,43,3],[2,0,2,3],[21,2,23,2],[40,0,40,3],[41,0,41,3],[42,0,42,3],[38,1,38,3]]}
[]
[]
["MATRIZ PARA DECIDIR SI  PUEDE PERTENECER AL REGIMEN SIMPLE"]
[]
[]
[]
[]
[null,"B.SOCIEDADES.",null,"S/N"]
[]
[1,"Sus accionistas son personas naturales residentes en Colombia?",null,"SI"]
[2,"Ingresos brutos del año anterior menores a 100.000  UVT?\nEl tope de ingresos brutos del año anterior deben ser menores  a 12.000 UVT para el caso de personas que presten servicios profesionales, de consultoría y científicos en los que predomine el factor intelectual sobre el material (diferentes de las  actividades de educación, atención de la salud humana y asistencia social del grupo 4) ",null,"SI"]
[3,"Ingresos brutos del presente  año de inicio menores a 100.000 UVT?\nPara los servicios profesionales del grupo 5, el tope de ingresos brutos del presente año deberán ser inferiores a 12.000 UVT ",null,"SI"]
[4,"Si realiza actividades de recolección, recuperación y comercialización de desperdicios, desechos y chatarra, de que trata el grupo 6 ¿verificó que las utilidades netas sean iguales o inferiores al 3% del ingreso bruto?",null,"SI"]
[5,"Cuenta con inscripción activa en el RUT y con todos mecanismos de cumplimiento del sistema de facturación electrónica?",null,"SI"]
[6,"Esta en capacidad de tener firma electrónica?",null,"SI"]
[7,"Es una persona jurídica extranjera o un establecimiento permanente de la persona jurídica extranjera?",null,"NO"]
[8,"Los socios o administradores de esta sociedad tienen en sustancia una relación laboral con el contratante por tratarse de servicios personales prestados con habitualidad y subordinación?",null,"NO"]
[9,"Esta sociedad es una filial, subsidiaria, agencia o sucursal de personas jurídicas nacionales o extranjeras no residentes?",null,"NO"]
[10,"Esta sociedad es accionista, sucriptora, partícipe, fideicomitente o beneficiaria de otras sociedades  o entidades legales en Colombia o en el exterior?.",null,"NO"]
[11,"Esta sociedad es una entidad financiera? ",null,"NO"]
[12,"Esta sociedad realiza actividades de microcrédito?.",null,"NO"]
[13,"Es intermediaria en gestión y venta de activos?","Con ingresos brutos ≥ al 20% de los ingresos totales","NO"]
[14,"Recibe arrendamientos?",null,"NO"]
[15,"Realiza actividades que generan rentas pasivas (dividendos, intereses, explotación de intangibles, etc, art. 884 E.T.)?",null,"NO"]
[16,"Realiza actividades de factoraje?",null,"NO"]
[17,"Presta servicios de asesoría financiera y/o estructuración de créditos?",null,"NO"]
[18,"Realiza la actividad de generacion,transmisión,distribución o comercialización de energía eléctrica?.",null,"NO"]
[19,"Realiza actividades de importación, exportación o comercialización de automóviles?",null,"NO"]
[20,"Realiza la actividad de importación de combustibles?",null,"NO"]
[21,"Se dedica a la producción o comercializacion de armas de fuego, municiones y pólvora,explosivos y detonantes? ",null,"NO"]
[22,"Desarrolla simultáneamente una de las actividades ubicadas en los numerales  14 a 23 y otra diferente?",null,"NO"]
[23,"¿Tiene rentas exentas o descuentos tributarios significativos? Recuerde que en el sistema SIMPLE se pierden estos beneficios",null,"NO"]
[24,"Esta sociedad es el resultado de una segregación, división o escisión de un negocio, que haya ocurrido en los 5 años anteriores al momento de la solicitud de inscripción a este régimen?",null,"NO"]
[25,"Realizó la matriz de decisión y determinó un ahorro de impuestos según sus ingresos, la rentabilidad, el efecto en el IVA para el Grupo 1 y el costo de los aportes a pensiones obligatorias del personal vinculado?",null,"SI"]
[]
[]
[null,"¿SE PUEDE ACOGER AL RÉGIMEN SIMPLE?",null,{"$f":"IF(AND(D10=\"SI\",D11=\"SI\",D12=\"SI\",D13=\"SI\",D14=\"SI\",D15=\"SI\",D16=\"NO\",D17=\"NO\",D18=\"NO\",D19=\"NO\",D20=\"NO\",D21=\"NO\",D22=\"NO\",D23=\"NO\",D24=\"NO\",D25=\"NO\",D26=\"NO\",D27=\"NO\",D28=\"NO\",D29=\"NO\",D30=\"NO\",D31=\"NO\",D32=\"NO\",D34=\"SI\",D33=\"NO\"),\"SÍ\",\"NO\")","v":"SÍ"}]
[]
[null,"Si al responder algunas de la preguntas propuestas el semáforo se prende en rojo, significará  que el contribuyente no podrá acogerse este sistema."]
[]
["* Si al evaluar todas las anteriores variables su cliente acierta todas las respuestas marcadas con color azul en el SI y en el NO,"]
["    tal como están estructuradas, usted se puede acoger al régimen SIMPLE."]
[]
["* Con una sola respuesta en sentido contrario  a las afirmaciones del SI o NO propuestas,  su cliente no podrá pertenecer al régimen SIMPLE. "]
["    "]

{"sheet":"PLANTILLA","index":2,"n_rows":74,"n_cols":5,"rows_kept":74,"cut":false,"hidden":false,"merged":[[47,0,47,3],[58,0,58,3],[4,0,4,3],[2,0,2,3],[9,0,9,3],[39,0,39,1]]}
[]
[]
["CONVENIENCIA DEL SISTEMA SIMPLE DE TRIBUTACIÓN VS RENTA ORDINARIA"]
[]
["Arts. 903 a 916 E.T. Actualizado con Ley 2277 de 2022"]
[]
[null,null,"Casillas diligenciables"]
[null,null,"Casillas no diligenciables"]
[]
["DATOS INFORMATIVOS"]
[]
["TIPO DE CONTRIBUYENTE:",null,"Persona Natural"]
[]
["Digite su Código CIIU actividad principal",null,141,null,{"$f":"IF(C18=\"T1\",\"\",IF(C18=\"T2\",\"\",IF(C18=\"T3\",\"\",IF(C18=\"T4\",\"\",\"NO PUEDE ACOGERSE\"))))","v":""}]
[]
["Digite su Código CIIU actividad secundaria",null,144]
[]
["Tarifa aplicable actividad principal",null,{"$f":"VLOOKUP(C14,'Código actividades'!A5:E457,5,FALSE)","v":"T2"}]
[]
["Tarifa aplicable actividad secundaria",null,{"$f":"IFERROR(VLOOKUP(C16,'Código actividades'!A5:E457,5,FALSE),C18)","v":"T2"}]
[]
["Es responsable de IVA antes de pertenecer al SIMPLE?",null,"SI"]
[]
["Ingresos brutos anuales (fiscales)",null,600000000]
[]
["Ingresos No Constitutivos de Renta ",null,18000000]
[]
["Ingresos Netos - Base SIMPLE",null,{"$f":"+C24-C26","v":582000000}]
[]
["Porcentaje rentabilidad sobre ingresos brutos",null,0.15]
[]
["Renta líquida",null,{"$f":"ROUND((C24*C30),-3)","v":90000000}]
[]
["Valor UVT",null,42412]
[]
["Tarifa ICA (Por mil)",null,0]
[]
["¿Avisos y tableros?",null,"NO"]
[]
["Porcentaje de compras con IVA\nSolo para el grupo 1",null,0]
[]
["Ingresos recaudados por medios electrónicos",null,0]
[]
["Aportes anuales a pensiones obligatorias a cargo del empleador",null,1670000]
[]
[]
[]
["DETERMINACIÓN DE IMPUESTOS POR EL RÉGIMEN ORDINARIO"]
[]
["Impuesto de renta sociedades",null,{"$f":"ROUND((IF(C12=\"Sociedad\",C32*35%,0)),-3)","v":0}]
["Impuesto de renta Persona Natural",null,{"$f":"IF(C12=\"Persona Natural\",SUM('Tarifa PN'!E6:E12),0)","v":9932000}]
["IVA"]
["ICA",null,{"$f":"ROUND((+C24*C36/1000),-3)","v":0}]
["Avisos y tableros",null,{"$f":"+IF(C38=\"SI\",(C53*15%),0)","v":0}]
[]
["TOTAL IMPUESTOS SISTEMA ORDINARIO",null,{"$f":"ROUND((SUM(C50:C54)),-3)","v":9932000}]
[]
[]
["DETERMINACIÓN DE IMPUESTO RÉGIMEN SIMPLE"]
[]
{"$rows_left_out":15}
{"sheet":"Código actividades","index":3,"n_rows":457,"n_cols":5,"rows_kept":457,"cut":false,"hidden":true,"merged":[]}
[]
[]
[]
["Código CIIU","Tipo de Actividad","Agrupación por Tarifa","Descripción Actividad Económica","TARIFA"]
[4711,"Comercial",201,"Comercio al por menor en establecimientos no especializados con surtido compuesto principalmente por alimentos, bebidas o tabaco.","T1"]
[4721,"Comercial",201,"Comercio al por menor de productos agrícolas para el consumo en establecimientos especializados.","T1"]
[4722,"Comercial",201,"Comercio al por menor de leche, productos lácteos y huevos, en establecimientos especializados.","T1"]
[4723,"Comercial",201,"Comercio al por menor de carnes (incluye aves de corral), productos cárnicos, pescados y productos de mar, en establecimientos especializados.","T1"]
[4724,"Comercial",203,"Comercio al por menor de bebidas y productos del tabaco, en establecimientos especializados.","T1"]
[4729,"Comercial",201,"Comercio al por menor de otros productos alimenticios n.c.p., en establecimientos especializados.","T1"]
[9602,"Servicios",304,"Peluquería y otros tratamientos de belleza.","T1"]
[161,161,"Actividades de apoyo a la agricultura.","Actividades de apoyo a la agricultura","T2"]
[162,"Servicios",304,"Actividades de apoyo a la ganadería.","T2"]
[164,"Servicios",304,"Tratamiento de semillas para propagación.","T2"]
[240,"Servicios",304,"Servicios de apoyo a la silvicultura.","T2"]
[510,"Industrial",103,"Extracción de hulla (carbón de piedra).","T2"]
[520,"Industrial",103,"Extracción de carbón lignito.","T2"]
[610,"Industrial",103,"Extracción de petróleo crudo.","T2"]
[620,"Industrial",103,"Extracción de gas natural.","T2"]
[710,"Industrial",103,"Extracción de minerales de hierro.","T2"]
[721,"Industrial",103,"Extracción de minerales de uranio y de torio.","T2"]
[722,"Industrial",103,"Extracción de oro y otros metales preciosos.","T2"]
[723,"Industrial",103,"Extracción de minerales de níquel.","T2"]
[729,"Industrial",103,"Extracción de otros minerales metalíferos no ferrosos n.c.p.","T2"]
[811,"Industrial",103,"Extracción de piedra, arena, arcillas comunes, yeso y anhidrita.","T2"]
[812,"Industrial",103,"Extracción de arcillas de uso industrial, caliza, caolín y bentonitas.","T2"]
[820,"Industrial",103,"Extracción de esmeraldas, piedras preciosas y semipreciosas.","T2"]
[891,"Industrial",103,"Extracción de minerales para la fabricación de abonos y productos químicos.","T2"]
[892,"Industrial",103,"Extracción de halita (sal).","T2"]
[899,"Industrial",103,"Extracción de otros minerales no metálicos n.c.p.","T2"]
[910,"Servicios",304,"Actividades de apoyo para la extracción de petróleo y de gas natural.","T2"]
[990,"Servicios",304,"Actividades de apoyo para otras actividades de explotación de minas y canteras.","T2"]
[1011,"Industrial",101,"Procesamiento y conservación de carne y productos cárnicos.","T2"]
[1012,"Industrial",101,"Procesamiento y conservación de pescados, crustáceos y moluscos.","T2"]
[1020,"Industrial",101,"Procesamiento y conservación de frutas, legumbres, hortalizas y tubérculos.","T2"]
[1030,"Industrial",101,"Elaboración de aceites y grasas de origen vegetal y animal.","T2"]
[1040,"Industrial",101,"Elaboración de productos lácteos.","T2"]
[1051,"Industrial",101,"Elaboración de productos de molinería.","T2"]
[1052,"Industrial",101,"Elaboración de almidones y productos derivados del almidón.","T2"]
[1061,"Servicios",304,"Trilla de café.","T2"]
[1062,"Industrial",101,"Descafeinado, tostión y molienda del café.","T2"]
[1063,"Industrial",101,"Otros derivados del café.","T2"]
[1071,"Industrial",101,"Elaboración y refinación de azúcar.","T2"]
[1072,"Industrial",101,"Elaboración de panela.","T2"]
[1081,"Industrial",101,"Elaboración de productos de panadería.","T2"]
[1082,"Industrial",101,"Elaboración de cacao, chocolate y productos de confitería.","T2"]
[1083,"Industrial",101,"Elaboración de macarrones, fideos, alcuzcuz y productos farináceos similares.","T2"]
[1084,"Industrial",101,"Elaboración de comidas y platos preparados.","T2"]
[1089,"Industrial",101,"Elaboración de otros productos alimenticios n.c.p.","T2"]
[1090,"Industrial",101,"Elaboración de alimentos preparados para animales.","T2"]
[1101,"Industrial",103,"Destilación, rectificación y mezcla de bebidas alcohólicas.","T2"]
[1102,"Industrial",103,"Elaboración de bebidas fermentadas no destiladas.","T2"]
[1103,"Industrial",103,"Producción de malta, elaboración de cervezas y otras bebidas malteadas.","T2"]
[1104,"Industrial",103,"Elaboración de bebidas no alcohólicas, producción de aguas minerales y de otras aguas embotelladas.","T2"]
[1200,"Industrial",103,"Elaboración de productos de tabaco","T2"]
[1311,"Industrial",103,"Preparación e hilatura de fibras textiles.","T2"]
[1312,"Industrial",103,"Tejeduría de productos textiles.","T2"]
[1313,"Industrial",103,"Acabado de productos textiles.","T2"]
[1391,"Industrial",103,"Fabricación de tejidos de punto y ganchillo.","T2"]
[1392,"Industrial",103,"Confección de artículos con materiales textiles, excepto prendas de vestir.","T2"]
{"$rows_left_out":398}
{"sheet":"Tarifa PN","index":4,"n_rows":16,"n_cols":5,"rows_kept":16,"cut":false,"hidden":true,"merged":[[0,0,0,4]]}
["TARIFA DE RENTA PERSONAS NATURALES. ART. 241 E.T."]
[]
[]
["Rangos en UVT",null,"Tarifa Marginal","Instrucción para calcular la retención (\"impuesto\") en $","Calculo en $ del valor de la retención"]
["desde","Hasta"]
[0,1090,0,"Ninguna",0]
[">1090",1700,0.19,"(Ingreso laboral gravado expresado en UVT menos 1090 UVT)*19%",{"$f":"IF($E$16>1090,(IF($E$16<=1700,ROUND(((($E$16-1090)*19%)*PLANTILLA!$C$34),-3),0)),0)","v":0}]
[">1700",4100,0.28000000000000003,"(Ingreso laboral gravado expresado en UVT menos 1700 UVT)*28% más 116 UVT",{"$f":"IF($E$16>1700,(IF($E$16<=4100,ROUND((((($E$16-1700)*28%)+116)*PLANTILLA!$C$34),-3),0)),0)","v":9932000}]
[">4100",8670,0.33,"(Ingreso laboral gravado expresado en UVT menos 4100 UVT)*33% más 788 UVT",{"$f":"IF($E$16>4100,(IF($E$16<=8670,ROUND((((($E$16-4100)*33%)+788)*PLANTILLA!$C$34),-3),0)),0)","v":0}]
[">8670",18970,0.35,"(Ingreso laboral gravado expresado en UVT menos 8670 UVT)*35% más 2296 UVT",{"$f":"IF($E$16>8670,(IF($E$16<=18970,ROUND((((($E$16-8670)*35%)+2296)*PLANTILLA!$C$34),-3),0)),0)","v":0}]
[">18970",31000,0.37,"(Ingreso laboral gravado expresado en UVT menos 18970 UVT)*37% más 5901 UVT",{"$f":"IF($E$16>18970,(IF($E$16<=31000,ROUND((((($E$16-18970)*37%)+5901)*PLANTILLA!$C$34),-3),0)),0)","v":0}]
[">31000","En adelante",0.39,"(Ingreso laboral gravado expresado en UVT menos 31000 UVT)*39% más 10352 UVT",{"$f":"IF($E$16>31000,ROUND(((($E$16-31000)*39%)+10352)*(PLANTILLA!$C$34),-3),0)","v":0}]
[]
[]
["RENTA LÍQUIDA EN PESOS",null,null,null,{"$f":"+IF(PLANTILLA!C12=\"Persona Natural\",PLANTILLA!C32,0)","v":90000000}]
["RENTA LÍQUIDA EN UVT",null,null,null,{"$f":"+E15/PLANTILLA!C34","v":2122.0409318117513}]

{"sheet":"Tarifas SIMPLE","index":5,"n_rows":64,"n_cols":8,"rows_kept":64,"cut":false,"hidden":true,"merged":[[0,1,0,6],[8,1,8,2],[8,3,8,4],[57,3,57,4],[57,1,57,2],[55,0,55,5],[49,3,49,4],[17,0,17,5],[49,1,49,2],[47,0,47,5],[19,3,19,4],[19,1,19,2],[29,1,29,2],[29,3,29,4],[39,1,39,2],[39,3,39,4]]}
[null,"TARIFAS RÉGIMEN SIMPLE"]
[]
[null,"INGRESOS EN PESOS",null,null,null,{"$f":"+PLANTILLA!C28","v":582000000}]
[]
[null,"INRESOS EN UVT",null,null,null,{"$f":"+F3/PLANTILLA!$C$34","v":13722.531359049326}]
[]
["1. Tiendas pequeñas, mini-mercados, micro-mercados y peluquería:"]
[]
[null,"INGRESOS BRUTOS ANUALES",null,"TARIFA SIMPLE"]
[null,"IGUAL O SUPERIOR (UVT)","INFERIOR (UVT)","CONSOLIDADA","IMPUESTO"]
[null,0,6000,1.2E-2,{"$f":"IF($F$5<6000,ROUND(($F$5*D11*PLANTILLA!$C$34),-3),0)","v":0}]
[null,6000,15000,2.8000000000000001E-2,{"$f":"IF(($F$5)>=6000,(IF($F$5<15000,ROUND((($F$5*D12)*PLANTILLA!$C$34),-3),0)),0)","v":16296000}]
[null,15000,30000,4.3999999999999997E-2,{"$f":"IF(($F$5)>=15000,(IF($F$5<30000,ROUND((($F$5*D13)*PLANTILLA!$C$34),-3),0)),0)","v":0}]
[null,30000,100000,5.6000000000000001E-2,{"$f":"IF(($F$5)>=30000,(IF($F$5<100000,ROUND((($F$5*D14)*PLANTILLA!$C$34),-3),0)),0)","v":0}]
[{"$nulls":4},{"$f":"SUM(E11:E14)","v":16296000}]
[]
[]
["2. Actividades comerciales al por mayor y detal; servicios técnicos y mecánicos en los que predomina el factor material sobre el intelectual, los electricistas, los albañiles, los servicios de construcción y los talleres mecánicos de vehículos y electrodomésticos; actividades industriales, incluidas las de agro-industria, miniindustria y micro-industria; actividades de telecomunicaciones; y las demás actividades no incluidas en los siguientes numerales:"]
[]
[null,"INGRESOS BRUTOS ANUALES",null,"TARIFA SIMPLE"]
[null,"IGUAL O SUPERIOR (UVT)","INFERIOR (UVT)","CONSOLIDADA","IMPUESTO"]
[null,0,6000,1.6E-2,{"$f":"IF($F$5<6000,ROUND(($F$5*D22*PLANTILLA!$C$34),-3),0)","v":0}]
[null,6000,15000,0.02,{"$f":"IF(($F$5)>=6000,(IF($F$5<15000,ROUND((($F$5*D23)*PLANTILLA!$C$34),-3),0)),0)","v":11640000}]
[null,15000,30000,3.5000000000000003E-2,{"$f":"IF(($F$5)>=15000,(IF($F$5<30000,ROUND((($F$5*D24)*PLANTILLA!$C$34),-3),0)),0)","v":0}]
[null,30000,100000,4.4999999999999998E-2,{"$f":"IF(($F$5)>=30000,(IF($F$5<100000,ROUND((($F$5*D25)*PLANTILLA!$C$34),-3),0)),0)","v":0}]
[{"$nulls":4},{"$f":"SUM(E22:E25)","v":11640000}]
[]
["3. Actividades de expendio de comidas y bebidas, y actividades de transporte:"]
[]
[null,"INGRESOS BRUTOS ANUALES",null,"TARIFA SIMPLE"]
[null,"IGUAL O SUPERIOR (UVT)","INFERIOR (UVT)","CONSOLIDADA","IMPUESTO"]
[null,0,6000,3.1E-2,{"$f":"IF($F$5<6000,ROUND(($F$5*D32*PLANTILLA!$C$34),-3),0)","v":0},null,null,{"$f":"38004*C32","v":228024000}]
[null,6000,15000,3.4000000000000002E-2,{"$f":"IF(($F$5)>=6000,(IF($F$5<15000,ROUND((($F$5*D33)*PLANTILLA!$C$34),-3),0)),0)","v":19788000},null,null,{"$f":"+H32*D32","v":7068744}]
[null,15000,30000,0.04,{"$f":"IF(($F$5)>=15000,(IF($F$5<30000,ROUND((($F$5*D34)*PLANTILLA!$C$34),-3),0)),0)","v":0}]
[null,30000,100000,4.4999999999999998E-2,{"$f":"IF(($F$5)>=30000,(IF($F$5<100000,ROUND((($F$5*D35)*PLANTILLA!$C$34),-3),0)),0)","v":0}]
[{"$nulls":4},{"$f":"SUM(E32:E35)","v":19788000}]
[]
["4 Educación y actividades de atención de la salud humana y de asistencia social:"]
[]
[null,"INGRESOS BRUTOS ANUALES",null,"TARIFA SIMPLE"]
[null,"IGUAL O SUPERIOR (UVT)","INFERIOR (UVT)","CONSOLIDADA","IMPUESTO"]
[null,0,6000,3.6999999999999998E-2,{"$f":"IF($F$5<6000,ROUND(($F$5*D42*PLANTILLA!$C$34),-3),0)","v":0}]
[null,6000,15000,0.05,{"$f":"IF(($F$5)>=6000,(IF($F$5<15000,ROUND((($F$5*D43)*PLANTILLA!$C$34),-3),0)),0)","v":29100000}]
[null,15000,30000,5.3999999999999999E-2,{"$f":"IF(($F$5)>=15000,(IF($F$5<30000,ROUND((($F$5*D44)*PLANTILLA!$C$34),-3),0)),0)","v":0}]
[null,30000,100000,5.8999999999999997E-2,{"$f":"IF(($F$5)>=30000,(IF($F$5<100000,ROUND((($F$5*D45)*PLANTILLA!$C$34),-3),0)),0)","v":0}]
[{"$nulls":4},{"$f":"SUM(E42:E45)","v":29100000}]
[]
["5. Servicios profesionales, de consultoría y científicos en los que predomine el factor intelectual sobre el material, incluidos los servicios de profesiones liberales:"]
[]
[null,"INGRESOS BRUTOS ANUALES",null,"TARIFA SIMPLE"]
[null,"IGUAL O SUPERIOR (UVT)","INFERIOR (UVT)","CONSOLIDADA","IMPUESTO"]
[null,0,6000,7.2999999999999995E-2,{"$f":"IF($F$5<6000,ROUND(($F$5*D52*PLANTILLA!$C$34),-3),0)","v":0}]
[null,6000,12000,8.3000000000000004E-2,{"$f":"IF(($F$5)>=6000,(IF($F$5<12000,ROUND((($F$5*D53)*PLANTILLA!$C$34),-3),0)),0)","v":0}]
[{"$nulls":4},{"$f":"SUM(E52:E53)","v":0}]
[]
["6. Actividades clasificadas en codigos CIIU 4665,3830, 3811"]
[]
[null,"INGRESOS BRUTOS ANUALES",null,"TARIFA SIMPLE"]
[null,"IGUAL O SUPERIOR (UVT)","INFERIOR (UVT)","CONSOLIDADA","IMPUESTO"]
[null,0,6000,1.6199999999999999E-2,{"$f":"IF($F$5<6000,ROUND(($F$5*D60*PLANTILLA!$C$34),-3),0)","v":0}]
{"$rows_left_out":4}